Reaction Details
TargetAmiloride-sensitive amine oxidase [copper-containing]
LigandBDBM50207159
Substrate/Competitorn/a
Meas. Tech.ChEBML_53890
Ki 140±n/a nM
Citation Griffith, RKDiPietro, RA Synthesis of 4(5)-imidazolyl allylamines and propargylamines as inhibitors of diamine oxidase Bioorg Med Chem Lett3:353-356 (1993)    Article
 
Amiloride-sensitive amine oxidase [copper-containing]
Name:Amiloride-sensitive amine oxidase [copper-containing]
Type:Protein
Mol. Mass.:85387.64
Organism:Homo sapiens (Human)
Description:P19801
Residue:751
BDBM50207159
NameBDBM50207159
Synonyms:2-aminoguanidine AMINOGUANIDINE Guanyl hydrazine Monoaminoguanidine | hydrazinecarboximidamide
TypeSmall organic molecule
Emp. Form.CH6N4
Mol. Mass.74.0851
SMILESNNC(N)=N