Reaction Details
TargetProtein kinase C alpha type
LigandBDBM50281600
Substrate/Competitorn/a
Meas. Tech.ChEBML_221029
Ki 165±n/a nM
Citation Winkler, JDHong, BCBahador, AKazanietz, MGBlumberg, PM Synthesis of ingenol analogs wth affinity for protein kinase C Bioorg Med Chem Lett3:577-580 (1993)    Article
 
Protein kinase C alpha type
Name:Protein kinase C alpha type
Type:Enzyme
Mol. Mass.:76755.65
Organism:Homo sapiens (Human)
Description:The recombinant human PKC enzymes were produced using a baculovirus expression system in SF9 cells
Residue:672
BDBM50281600
NameBDBM50281600
Synonyms:7-hydroxymethyl-14-oxo-4-phenylcarbonyloxytricyclo[7.4.1.01,5]tetradec-7-ene | CHEMBL156719
TypeSmall organic molecule
Emp. Form.C22H26O4
Mol. Mass.354.4394
SMILESOCC1=C[C@H]2CCCCC3(CC[C@H](OC(=O)c4ccccc4)[C@H]3C1)C2=O