Reaction Details
TargetMu-type opioid receptor
LigandBDBM50281661
Substrate/Competitorn/a
Meas. Tech.ChEBML_139005
Ki>10000±n/a nM
Citation Higginbottom, MNolan, WO'Toole, JRatcliffe, GSRees, DCRoberts, E The design and synthesis of kappa opioid ligands based on a binding model for kappa agonists Bioorg Med Chem Lett3:841-846 (1993)    Article
 
Mu-type opioid receptor
Name:Mu-type opioid receptor
Type:G Protein-Coupled Receptor (GPCR)
Mol. Mass.:44789.51
Organism:Homo sapiens (Human)
Description:P35372
Residue:400
BDBM50281661
NameBDBM50281661
Synonyms:2-Oxa-7,10-diaza-bicyclo[11.3.1]heptadeca-1(17),13,15-trien-11-one PD-146884
TypeSmall organic molecule
Emp. Form.C14H20N2O2
Mol. Mass.248.3208
SMILESO=C1Cc2cccc(OCCCCNCCN1)c2