Reaction Details
TargetKappa-type opioid receptor
LigandBDBM50281663
Substrate/Competitorn/a
Meas. Tech.ChEBML_145964
Ki 0.210000±n/a nM
Citation Higginbottom, MNolan, WO'Toole, JRatcliffe, GSRees, DCRoberts, E The design and synthesis of kappa opioid ligands based on a binding model for kappa agonists Bioorg Med Chem Lett3:841-846 (1993)    Article
 
Kappa-type opioid receptor
Name:Kappa-type opioid receptor
Type:G Protein-Coupled Receptor (GPCR)
Mol. Mass.:42648.76
Organism:Homo sapiens (Human)
Description:P41145
Residue:380
BDBM50281663
NameBDBM50281663
Synonyms:10-cyclopropylmethyl-1-ethyl-4-hydroxy-13-methyl-(1R,9S,13R)-10-azatricyclo[7.3.1.02,7]trideca-2(7),3,5-trien-8-one CHEMBL422551
TypeSmall organic molecule
Emp. Form.C19H25NO2
Mol. Mass.299.4073
SMILESCC[C@]12CCN(CC3CC3)[C@@H]([C@@H]1C)C(=O)c1ccc(O)cc21