Reaction Details
TargetGastrin/cholecystokinin type B receptor
LigandBDBM50243981
Substrate/Competitorn/a
Meas. Tech.ChEMBL_47972 (CHEMBL657475)
IC50>100000±n/a nM
Citation Evans, BERittle, KEChang, RSLotti, VJFreedman, SBFreidinger, RM Multipurpose receptor ligands: β-carboline cholecystokinin antagonists Bioorg Med Chem Lett3:867-870 (1993)    Article
 
Gastrin/cholecystokinin type B receptor
Name:Gastrin/cholecystokinin type B receptor
Type:G Protein-Coupled Receptor (GPCR)
Mol. Mass.:48445.79
Organism:Homo sapiens (Human)
Description:Stable expression of human CCK-2 receptors in HEK 293 cells.
Residue:447
BDBM50243981
NameBDBM50243981
Synonyms:Beta CCM Methyl Beta-carboline-3 carboxylate | methyl 9H-pyrido[3,4-b]indole-3-carboxylate
TypeSmall organic molecule
Emp. Form.C13H10N2O2
Mol. Mass.226.2307
SMILESCOC(=O)c1cc2c(cn1)[nH]c1ccccc21