Reaction Details
TargetNeuropeptide Y receptor type 2
LigandBDBM50281775
Substrate/Competitorn/a
Meas. Tech.ChEMBL_144147 (CHEMBL750762)
IC50 5.00±n/a nM
Citation Beck-Sickinger, AGHoffmann, EGaida, WGrouzmann, EDürr, HJung, G Novel Y2-selective, reduced-size agonists of neuropeptide Y Bioorg Med Chem Lett3:937-942 (1993)    Article
 
Neuropeptide Y receptor type 2
Name:Neuropeptide Y receptor type 2
Type:Enzyme Catalytic Domain
Mol. Mass.:42734.65
Organism:Homo sapiens (Human)
Description:NPY-Y2 NPY2R HUMAN::P49146
Residue:381
BDBM50281775
NameBDBM50281775
Synonyms:Ac-RHYINL-(Cha)-TRQRY | CHEMBL414482
TypeSmall organic molecule
Emp. Form.C77H121N25O19
Mol. Mass.1700.9407
SMILESCC[C@H](C)[C@H](NC(=O)[C@H](Cc1ccc(O)cc1)NC(=O)[C@H](Cc1cnc[nH]1)NC(=O)[C@H](CCCNC(N)=N)NC(C)=O)C(=O)N[C@@H](CC(N)=O)C(=O)N[C@@H](CC(C)C)C(=O)N[C@@H](C1CCCCC1)C(=O)N[C@@H]([C@@H](C)O)C(=O)N[C@@H](CCCNC(N)=N)C(=O)N[C@@H](CCC(N)=O)C(=O)N[C@@H](CCCNC(N)=N)C(=O)N[C@@H](Cc1ccc(O)cc1)C(O)=O