Reaction Details
TargetNeuropeptide Y receptor type 2
LigandBDBM50281779
Substrate/Competitorn/a
Meas. Tech.ChEBML_144150
IC50 180±n/a nM
Citation Beck-Sickinger, AGHoffmann, EGaida, WGrouzmann, EDürr, HJung, G Novel Y2-selective, reduced-size agonists of neuropeptide Y Bioorg Med Chem Lett3:937-942 (1993)    Article
 
Neuropeptide Y receptor type 2
Name:Neuropeptide Y receptor type 2
Type:Enzyme Catalytic Domain
Mol. Mass.:42734.65
Organism:Homo sapiens (Human)
Description:NPY-Y2 NPY2R HUMAN::P49146
Residue:381
BDBM50281779
NameBDBM50281779
Synonyms:CHEMBL438580 | Neuropeptide Y analogue
TypeSmall organic molecule
Emp. Form.C102H162N32O24
Mol. Mass.2220.5777
SMILESCC[C@H](C)[C@H](NC(=O)[C@H](Cc1ccc(O)cc1)NC(=O)[C@H](Cc1cnc[nH]1)NC(=O)[C@H](CCCNC(N)=N)NC(=O)CCCCCNC(=O)[C@H](CCCCN)NC(=O)[C@H](CO)NC(=O)[C@@H]1CCCN1C(=O)[C@@H](N)Cc1ccc(O)cc1)C(=O)N[C@@H](CC(N)=O)C(=O)N[C@@H](CC(C)C)C(=O)N[C@@H]([C@@H](C)CC)C(=O)N[C@@H]([C@@H](C)O)C(=O)N[C@@H](CCCNC(N)=N)C(=O)N[C@@H](CCC(N)=O)C(=O)N[C@@H](CCCNC(N)=N)C(=O)N[C@@H](Cc1ccc(O)cc1)C(N)=O