Reaction Details
TargetLeukotriene B4 receptor 1
LigandBDBM50281874
Substrate/Competitorn/a
Meas. Tech.ChEMBL_98504 (CHEMBL709166)
Ki 15±n/a nM
Citation Sofia, MJFloreancig, PJackson, WTMarder, PSaussy, DLSilbaugh, SACockerham, SLFroelich, LLRoman, CRStengel, PWFleisch, JH Acid unit modifications of 1,2,4,5-substituted hydroxyacetophenones and the effect on in vitro and in vivo LTB4 receptor antagonism Bioorg Med Chem Lett3:1147-1152 (1993)    Article
 
Leukotriene B4 receptor 1
Name:Leukotriene B4 receptor 1
Type:Enzyme Catalytic Domain
Mol. Mass.:37582.68
Organism:Homo sapiens (Human)
Description:Q15722
Residue:352
BDBM50281874
NameBDBM50281874
Synonyms:6-[3-(4-Acetyl-3-methoxy-2-propyl-phenoxy)-propoxy]-8-propyl-chroman-2-carboxylic acid | CHEMBL15817
TypeSmall organic molecule
Emp. Form.C28H36O7
Mol. Mass.484.5812
SMILESCCCc1cc(OCCCOc2ccc(C(C)=O)c(OC)c2CCC)cc2CCC(Oc12)C(O)=O