Reaction Details
TargetLeukotriene B4 receptor 1
LigandBDBM50281877
Substrate/Competitorn/a
Meas. Tech.ChEMBL_98504 (CHEMBL709166)
Ki 19±n/a nM
Citation Sofia, MJFloreancig, PJackson, WTMarder, PSaussy, DLSilbaugh, SACockerham, SLFroelich, LLRoman, CRStengel, PWFleisch, JH Acid unit modifications of 1,2,4,5-substituted hydroxyacetophenones and the effect on in vitro and in vivo LTB4 receptor antagonism Bioorg Med Chem Lett3:1147-1152 (1993)    Article
 
Leukotriene B4 receptor 1
Name:Leukotriene B4 receptor 1
Type:Enzyme Catalytic Domain
Mol. Mass.:37582.68
Organism:Homo sapiens (Human)
Description:Q15722
Residue:352
BDBM50281877
NameBDBM50281877
Synonyms:2-{3-[3-(4-Acetyl-2-ethyl-5-hydroxy-phenoxy)-propoxy]-2-propyl-phenoxy}-propionic acid | CHEMBL15299
TypeSmall organic molecule
Emp. Form.C25H32O7
Mol. Mass.444.5174
SMILESCCCc1c(OCCCOc2cc(O)c(cc2CC)C(C)=O)cccc1OC(C)C(O)=O