Reaction Details
TargetD(2) dopamine receptor
LigandBDBM50001888
Substrate/Competitorn/a
Meas. Tech.ChEBML_63039
Ki 50±n/a nM
Citation Markovich, KMFarooqui, TWallace, LJUretsky, NJMiller, DD Enhancement of binding of quaternary ammonium derivatives of chlorpromaxine to dopamine D-2 receptors by the addition of a H-bonding group Bioorg Med Chem Lett3:1241-1244 (1993)    Article
 
D(2) dopamine receptor
Name:D(2) dopamine receptor
Type:G Protein-Coupled Receptor (GPCR)
Mol. Mass.:50931.60
Organism:Rattus norvegicus (rat)
Description:P61169
Residue:444
BDBM50001888
NameBDBM50001888
Synonyms:(chloropromazine) [3-(2-Chloro-phenothiazin-10-yl)-propyl]-dimethyl-amine 1-(2-Allyl-phenoxy)-3-isopropylamino-propan-2-ol 3-(2-chloro-10H-phenothiazin-10-yl)-N,N-dimethylpropan-1-amine CHLORPROMAZINE CHLORPROMAZINE HYDROCHLORIDE CHLORPROMAZINE TANNATE PROMAPAR THORAZINE [3-(2-Chloro-phenothiazin-10-yl)-propyl]-dimethyl-amine( Chlorpromazine) chloropromazine | med.21724, Compound 15
TypeSmall organic molecule
Emp. Form.C17H19ClN2S
Mol. Mass.318.864
SMILESCN(C)CCCN1c2ccccc2Sc2ccc(Cl)cc12