Reaction Details
Target3-phosphoshikimate 1-carboxyvinyltransferase
LigandBDBM50281993
Substrate/Competitorn/a
Meas. Tech.ChEMBL_65087 (CHEMBL673144)
Ki 1500±n/a nM
Citation Miller, MJAnderson, KSBraccolino, DSCleary, DGGruys, KJHan, CYLin, KCPansegrau, PDReam, JESammons, RDSikorski, JA EPSP synthase inhibitor design II. The importance of the 3-phosphate group for ligand binding at the shikimate-3-phosphate site & the identification of 3-malonate ethers as novel 3-phosphate mimics. Bioorg Med Chem Lett3:1435-1440 (1993)    Article
 
3-phosphoshikimate 1-carboxyvinyltransferase
Name:3-phosphoshikimate 1-carboxyvinyltransferase
Type:PROTEIN
Mol. Mass.:46089.22
Organism:Escherichia coli (strain K12)
Description:ChEMBL_65087
Residue:427
BDBM50281993
NameBDBM50281993
Synonyms:CHEMBL287334 | Trisodium salt of (3R,4S,5R)-5-Carboxymethoxy-4-hydroxy-3-phosphonooxy-cyclohex-1-enecarboxylic acid
TypeSmall organic molecule
Emp. Form.C9H10O10P
Mol. Mass.309.1451
SMILESO[C@H]1[C@@H](CC(=C[C@H]1OP(O)([O-])=O)C([O-])=O)OCC([O-])=O