Reaction Details
TargetNeutrophil elastase
LigandBDBM50282868
Substrate/Competitorn/a
Meas. Tech.ChEBML_64002
Ki 0.700000±n/a nM
Citation Hlasta, DJBell, MRBoaz, NWCourt, JJDesai, RCFranke, CAMura, AJSubramanyam, CDunlap, RP A benzisothiazolone class of potent, selective mechanism-based inhibitors of human leukocyte elastase Bioorg Med Chem Lett4:1801-1806 (1994)    Article
 
Neutrophil elastase
Name:Neutrophil elastase
Type:Enzyme
Mol. Mass.:28532.38
Organism:Homo sapiens (Human)
Description:P08246
Residue:267
BDBM50282868
NameBDBM50282868
Synonyms:1,1-Dioxo-2-(1-phenyl-1H-tetrazol-5-ylsulfanylmethyl)-4-propyl-1,2-dihydro-1lambda*6*-benzo[d]isothiazol-3-one | CHEMBL299656
TypeSmall organic molecule
Emp. Form.C18H17N5O3S2
Mol. Mass.415.489
SMILESCCCc1cccc2c1C(=O)N(CSc1nnnn1-c1ccccc1)S2(=O)=O