Reaction Details
TargetMu-type opioid receptor
LigandBDBM50016867
Substrate/Competitorn/a
Meas. Tech.ChEBML_138889
Ki 0.380000±n/a nM
Citation Sasaki, YWatanabe, YAmbo, ASuzuki, K Synthesis and biological properties of quaternized N-methylation analogs of D-Arg-2-dermorphin tetrapeptide Bioorg Med Chem Lett4:2049-2054 (1994)    Article
 
Mu-type opioid receptor
Name:Mu-type opioid receptor
Type:G Protein-Coupled Receptor (GPCR)
Mol. Mass.:44503.11
Organism:Rattus norvegicus (rat)
Description:Competition binding assays were carried out using membrane preparations from transfected HN9.10 cells that constitutively expressed the mu opioid receptor.
Residue:398
BDBM50016867
NameBDBM50016867
Synonyms:(S)-6-Amino-2-((S)-2-{(R)-2-[(S)-2-amino-3-(4-hydroxy-phenyl)-propionylamino]-5-guanidino-pentanoylamino}-3-phenyl-propionylamino)-hexanoic acid amide CHEMBL60444
TypeSmall organic molecule
Emp. Form.C30H45N9O5
Mol. Mass.611.7356
SMILESNCCCC[C@H](NC(=O)[C@H](Cc1ccccc1)NC(=O)[C@@H](CCCNC(N)=N)NC(=O)[C@@H](N)Cc1ccc(O)cc1)C(N)=O