Reaction Details
TargetSigma non-opioid intracellular receptor 1
LigandBDBM50283327
Substrate/Competitorn/a
Meas. Tech.ChEBML_201298
Ki 1±n/a nM
Citation Christos, TECain, GAJohnson, ALSchmidt, WKTam, SW Novel ether derivatives of alkyl piperidines as potential sigma / 5HT2 antipsychotic agents Bioorg Med Chem Lett4:2347-2352 (1994)    Article
 
Sigma non-opioid intracellular receptor 1
Name:Sigma non-opioid intracellular receptor 1
Type:Enzyme Catalytic Domain
Mol. Mass.:25124.85
Organism:Homo sapiens (Human)
Description:Q99720
Residue:223
BDBM50283327
NameBDBM50283327
Synonyms:1-Cyclopropylmethyl-4-[2-(3-phenyl-prop-2-ynyloxy)-ethyl]-piperidine | CHEMBL75678
TypeSmall organic molecule
Emp. Form.C20H27NO
Mol. Mass.297.4345
SMILESC(CC1CCN(CC2CC2)CC1)OCC#Cc1ccccc1