Reaction Details
TargetCaspase-1
LigandBDBM50283350
Substrate/Competitorn/a
Meas. Tech.ChEBML_91005
Ki 1700±n/a nM
Citation Mullican, MDLauffer, DJGillespie, RJMatharu, SSKay, DPorritt, GMEvans, PLGolec, JMMurcko, MALuong, YPRaybuck, SALivingston, DJ The synthesis and evaluation of peptidyl aspartyl aldehydes as inhibitors of ice. Bioorg Med Chem Lett4:2359-2364 (1994)    Article
 
Caspase-1
Name:Caspase-1
Type:Enzyme
Mol. Mass.:45154.13
Organism:Homo sapiens (Human)
Description:P29466
Residue:404
BDBM50283350
NameBDBM50283350
Synonyms:(S)-3-[(S)-2-((S)-2-Acetylamino-3-methyl-butyrylamino)-propionylamino]-4-oxo-butyric acid | CHEMBL75643
TypeSmall organic molecule
Emp. Form.C14H23N3O6
Mol. Mass.329.3489
SMILESCC(C)[C@H](NC(C)=O)C(=O)N[C@@H](C)C(=O)N[C@@H](CC(O)=O)C=O