Reaction Details
TargetPolyunsaturated fatty acid 5-lipoxygenase
LigandBDBM50283416
Substrate/Competitorn/a
Meas. Tech.ChEBML_3954
IC50 5±n/a nM
Citation LeMahieu, RACarson, MHan, RJWill, PCThomas, TKNagy, CCominelli, F 4-[5-(2,3-dihydroxyphenyl)pentyloxy]-2-hydroxy-3-propylbenzoic acid (Ro 24-0553): an orally active 5-lipoxygenase inhibitor with antiinflammatory activity Bioorg Med Chem Lett4:339-344 (1994)    Article
 
Polyunsaturated fatty acid 5-lipoxygenase
Name:Polyunsaturated fatty acid 5-lipoxygenase
Type:PROTEIN
Mol. Mass.:78082.31
Organism:Rattus norvegicus
Description:ChEMBL_1432947
Residue:673
BDBM50283416
NameBDBM50283416
Synonyms:4-[7-(2,3-Dihydroxy-phenyl)-heptyloxy]-2-hydroxy-3-propyl-benzoic acid | CHEMBL114516
TypeSmall organic molecule
Emp. Form.C23H30O6
Mol. Mass.402.4807
SMILESCCCc1c(O)c(ccc1OCCCCCCCc1cccc(O)c1O)C(O)=O