Reaction Details
TargetAdenosine receptor A2a
LigandBDBM50283531
Substrate/Competitorn/a
Meas. Tech.ChEMBL_31059 (CHEMBL873043)
Ki 13.7±n/a nM
Citation Baraldi, PGManfredini, SSimoni, DZappaterra, LZocchi, CDionisotti, SOngini, E Synthesis of new pyrazolo[4,3-e]1,2,4-triazolo[1,5-c] pyrimidine and 1,2,3-triazolo[4,5-e]1,2,4-triazolo[1,5-c] pyrimidine displaying potent and selective activity as A2a adenosine receptor antagonists. Bioorg Med Chem Lett4:2539-2544 (1994)    Article
 
Adenosine receptor A2a
Name:Adenosine receptor A2a
Type:G Protein-Coupled Receptor (GPCR)
Mol. Mass.:45015.65
Organism:Rattus norvegicus (rat)
Description:Rat A2A receptors expressed in CHO cells.
Residue:410
BDBM50283531
NameBDBM50283531
Synonyms:3-(4-Fluoro-benzyl)-8-furan-2-yl-3H-[1,2,3]triazolo[4,5-e][1,2,4]triazolo[1,5-c]pyrimidin-5-ylamine | CHEMBL83235
TypeSmall organic molecule
Emp. Form.C16H11FN8O
Mol. Mass.350.3099
SMILESNc1nc2n(Cc3ccc(F)cc3)nnc2c2nc(nn12)-c1ccco1