Reaction Details
TargetAdenosine receptor A1
LigandBDBM50283527
Substrate/Competitorn/a
Meas. Tech.ChEMBL_29476 (CHEMBL640469)
Ki 13.7±n/a nM
Citation Baraldi, PGManfredini, SSimoni, DZappaterra, LZocchi, CDionisotti, SOngini, E Synthesis of new pyrazolo[4,3-e]1,2,4-triazolo[1,5-c] pyrimidine and 1,2,3-triazolo[4,5-e]1,2,4-triazolo[1,5-c] pyrimidine displaying potent and selective activity as A2a adenosine receptor antagonists. Bioorg Med Chem Lett4:2539-2544 (1994)    Article
 
Adenosine receptor A1
Name:Adenosine receptor A1
Type:Protein
Mol. Mass.:36704.13
Organism:Rattus norvegicus (rat)
Description:n/a
Residue:326
BDBM50283527
NameBDBM50283527
Synonyms:3-(2-Fluoro-benzyl)-8-furan-2-yl-3H-[1,2,3]triazolo[4,5-e][1,2,4]triazolo[1,5-c]pyrimidin-5-ylamine | CHEMBL85973
TypeSmall organic molecule
Emp. Form.C16H11FN8O
Mol. Mass.350.3099
SMILESNc1nc2n(Cc3ccccc3F)nnc2c2nc(nn12)-c1ccco1