Reaction Details
Target72 kDa type IV collagenase
LigandBDBM50283713
Substrate/Competitorn/a
Meas. Tech.ChEBML_101923
Ki 0.020000±n/a nM
Citation Porter, JRBeeley, NRBoyce, BAMason, BMillican, AMillar, KLeonard, JMorphy, JRO'Connell, JP Potent and selective inhibitors of gelatinase-a 1. hydroxamic acid derivatives Bioorg Med Chem Lett4:2741-2746 (1994)    Article
 
72 kDa type IV collagenase
Name:72 kDa type IV collagenase
Type:Enzyme
Mol. Mass.:73870.36
Organism:Homo sapiens (Human)
Description: P08253
Residue:660
BDBM50283713
NameBDBM50283713
Synonyms:(R)-N*1*-[(S)-2-Cyclohexyl-1-(4-dimethylamino-butylcarbamoyl)-ethyl]-N*4*-hydroxy-2-(3-p-tolyl-propyl)-succinamide | CHEMBL93791
TypeSmall organic molecule
Emp. Form.C29H48N4O4
Mol. Mass.516.7158
SMILESCN(C)CCCCNC(=O)[C@H](CC1CCCCC1)NC(=O)[C@H](CCCc1ccc(C)cc1)CC(=O)NO