Reaction Details
TargetStromelysin-1
LigandBDBM50283715
Substrate/Competitorn/a
Meas. Tech.ChEBML_102088
Ki 2.8±n/a nM
Citation Porter, JRBeeley, NRBoyce, BAMason, BMillican, AMillar, KLeonard, JMorphy, JRO'Connell, JP Potent and selective inhibitors of gelatinase-a 1. hydroxamic acid derivatives Bioorg Med Chem Lett4:2741-2746 (1994)    Article
 
Stromelysin-1
Name:Stromelysin-1
Type:Enzyme
Mol. Mass.:53973.13
Organism:Homo sapiens (Human)
Description: P08254
Residue:477
BDBM50283715
NameBDBM50283715
Synonyms:(R)-N*1*-{(S)-2-Cyclohexyl-1-[2-(morpholine-4-sulfonylamino)-ethylcarbamoyl]-ethyl}-N*4*-hydroxy-2-(3-p-tolyl-propyl)-succinamide | CHEMBL93583
TypeSmall organic molecule
Emp. Form.C29H47N5O7S
Mol. Mass.609.778
SMILESCc1ccc(CCC[C@H](CC(=O)NO)C(=O)N[C@@H](CC2CCCCC2)C(=O)NCCNS(=O)(=O)N2CCOCC2)cc1