Reaction Details
Target72 kDa type IV collagenase
LigandBDBM50283708
Substrate/Competitorn/a
Meas. Tech.ChEBML_101923
Ki 0.010000±n/a nM
Citation Porter, JRBeeley, NRBoyce, BAMason, BMillican, AMillar, KLeonard, JMorphy, JRO'Connell, JP Potent and selective inhibitors of gelatinase-a 1. hydroxamic acid derivatives Bioorg Med Chem Lett4:2741-2746 (1994)    Article
 
72 kDa type IV collagenase
Name:72 kDa type IV collagenase
Type:Enzyme
Mol. Mass.:73870.36
Organism:Homo sapiens (Human)
Description: P08253
Residue:660
BDBM50283708
NameBDBM50283708
Synonyms:3-{(S)-2-[(R)-5-(4-Chloro-phenyl)-2-hydroxycarbamoylmethyl-pentanoylamino]-3-cyclohexyl-propionylamino}-propionic acid methyl ester | CHEMBL92828
TypeSmall organic molecule
Emp. Form.C26H38ClN3O6
Mol. Mass.524.049
SMILESCOC(=O)CCNC(=O)[C@H](CC1CCCCC1)NC(=O)[C@H](CCCc1ccc(Cl)cc1)CC(=O)NO