Reaction Details
TargetInterstitial collagenase
LigandBDBM50101526
Substrate/Competitorn/a
Meas. Tech.ChEBML_101759
Ki 296±n/a nM
Citation Porter, JRBeeley, NRBoyce, BAMason, BMillican, AMillar, KLeonard, JMorphy, JRO'Connell, JP Potent and selective inhibitors of gelatinase-a 1. hydroxamic acid derivatives Bioorg Med Chem Lett4:2741-2746 (1994)    Article
 
Interstitial collagenase
Name:Interstitial collagenase
Type:Enzyme
Mol. Mass.:54010.26
Organism:Homo sapiens (Human)
Description: P03956
Residue:469
BDBM50101526
NameBDBM50101526
Synonyms:(R)-N*1*-((S)-2-Cyclohexyl-1-phenethylcarbamoyl-ethyl)-2-[3-(4-fluoro-phenyl)-propyl]-N*4*-hydroxy-succinamide N*1*-(2-Cyclohexyl-1-phenethylcarbamoyl-ethyl)-2-[3-(4-fluoro-phenyl)-propyl]-N*4*-hydroxy-succinamide
TypeSmall organic molecule
Emp. Form.C30H40FN3O4
Mol. Mass.525.6547
SMILESONC(=O)C[C@@H](CCCc1ccc(F)cc1)C(=O)N[C@@H](CC1CCCCC1)C(=O)NCCc1ccccc1