Reaction Details
Target72 kDa type IV collagenase
LigandBDBM50101523
Substrate/Competitorn/a
Meas. Tech.ChEBML_101924
Ki 0.900000±n/a nM
Citation Morphy, JRBeeley, NRBoyce, BALeonard, JMason, BMillican, AMillar, KO'Connell, JPPorter, J Potent and selective inhibitors of gelatinase-A 2. carboxylic and phosphonic acid derivatives Bioorg Med Chem Lett4:2747-2752 (1994)    Article
 
72 kDa type IV collagenase
Name:72 kDa type IV collagenase
Type:Enzyme
Mol. Mass.:73870.36
Organism:Homo sapiens (Human)
Description: P08253
Residue:660
BDBM50101523
NameBDBM50101523
Synonyms:(R)-3-{(S)-2-Cyclohexyl-1-[2-(4-sulfamoyl-phenyl)-ethylcarbamoyl]-ethylcarbamoyl}-6-p-tolyl-hexanoic acid CHEMBL78335
TypeSmall organic molecule
Emp. Form.C31H43N3O6S
Mol. Mass.585.755
SMILESCc1ccc(CCC[C@H](CC(O)=O)C(=O)N[C@@H](CC2CCCCC2)C(=O)NCCc2ccc(cc2)S(N)(=O)=O)cc1