Reaction Details
TargetInterstitial collagenase
LigandBDBM50283779
Substrate/Competitorn/a
Meas. Tech.ChEBML_101742
IC50 360±n/a nM
Citation Hunter, DJBird, JCassidy, FDe Mello, RCHarper, GPKarran, EHMarkwell, REMiles-Williams, AJWard, RW Aminophosphonic acid containing inhibitors of human collagenase: modification of the P1 residue Bioorg Med Chem Lett4:2833-2836 (1994)    Article
 
Interstitial collagenase
Name:Interstitial collagenase
Type:Enzyme
Mol. Mass.:54010.26
Organism:Homo sapiens (Human)
Description: P03956
Residue:469
BDBM50283779
NameBDBM50283779
Synonyms:CHEMBL96018 | {(R)-3-(1,3-Dioxo-1,3-dihydro-isoindol-2-yl)-1-[(S)-3-methyl-1-((S)-1-methylcarbamoyl-2-phenyl-ethylcarbamoyl)-butylamino]-propyl}-phosphonic acid
TypeSmall organic molecule
Emp. Form.C27H35N4O7P
Mol. Mass.558.5632
SMILESCNC(=O)[C@H](Cc1ccccc1)NC(=O)[C@H](CC(C)C)N[C@@H](CCN1C(=O)c2ccccc2C1=O)P(O)(O)=O