Reaction Details
TargetNeprilysin
LigandBDBM50034851
Substrate/Competitorn/a
Meas. Tech.ChEMBL_144601 (CHEMBL751020)
IC50 1.6±n/a nM
Citation Stanton, JLKsander, GMJesus, RdSperbeck, DM The effect of heteroatom substitution on a series of phosphonate inhibitors of neutral endopeptidase 24.11 Bioorg Med Chem Lett4:539-542 (1994)    Article
 
Neprilysin
Name:Neprilysin
Type:Protein
Mol. Mass.:85789.59
Organism:Rattus norvegicus (Rat)
Description:P07861
Residue:750
BDBM50034851
NameBDBM50034851
Synonyms:3-[(S)-3-Biphenyl-4-yl-2-(phosphonomethyl-amino)-propionylamino]-propionic acid CHEMBL285038 | diphenyl alpha -aminomethyl phosphonate
TypeSmall organic molecule
Emp. Form.C19H23N2O6P
Mol. Mass.406.3695
SMILESOC(=O)CCNC(=O)[C@H](Cc1ccc(cc1)-c1ccccc1)NCP(O)(O)=O