Reaction Details
TargetProtein kinase C alpha type
LigandBDBM50283971
Substrate/Competitorn/a
Meas. Tech.ChEMBL_160256 (CHEMBL767870)
Ki 41000±n/a nM
Citation Lee, JMarquez, VELewin, NEBlumberg, PM Conformationally constrained analogues of DAG.7. Interaction of a medium-size ε-lactone with protein kinase C (PK-C)_ Bioorg Med Chem Lett4:543-548 (1994)    Article
 
Protein kinase C alpha type
Name:Protein kinase C alpha type
Type:Protein
Mol. Mass.:76797.67
Organism:Rattus norvegicus (Rat)
Description:P05696
Residue:672
BDBM50283971
NameBDBM50283971
Synonyms:CHEMBL153171 | Tetradecanoic acid (2S,3R)-2-hydroxymethyl-7-oxo-oxepan-3-yl ester
TypeSmall organic molecule
Emp. Form.C21H38O5
Mol. Mass.370.5234
(=O)O[C@@H]1CCCC(=O)O[C@H]1CO