Reaction Details
TargetProtein farnesyltransferase subunit beta/geranylgeranyltransferase type-1 subunit alpha
LigandBDBM50284631
Substrate/Competitorn/a
Meas. Tech.ChEMBL_70111 (CHEMBL681646)
IC50 370±n/a nM
Citation Rawson, TESomers, TCMarsters, JCWan, DTReynolds, MEBurdick, DJ Stereochemistry of the benzodiazepine based Ras farnesyltransferase inhibitors Bioorg Med Chem Lett5:1335-1338 (1995)    Article
 
Protein farnesyltransferase subunit beta/geranylgeranyltransferase type-1 subunit alpha
Name:Protein farnesyltransferase subunit beta/geranylgeranyltransferase type-1 subunit alpha
Type:n/a
Mol. Mass.:n/a
Description:ASSAY_ID of EBI is 69815
Components:This complex has 2 components.
Component 1
Name:Protein farnesyltransferase subunit beta
Synonyms:CAAX farnesyltransferase subunit beta FTase-beta Protein farnesyltransferase Ras proteins prenyltransferase subunit beta
Type:PROTEIN
Mol. Mass.:48666.41
Organism:Rattus norvegicus
Description:EBI_10573
Residue:437
Component 2
Name:Protein farnesyltransferase/geranylgeranyltransferase type-1 subunit alpha
Synonyms:CAAX farnesyltransferase alpha subunit FTase-alpha GGTase-I-alpha Protein farnesyltransferase/geranylgeranyltransferase type I alpha subunit Type I protein geranyl-geranyltransferase alpha subunit | geranylgeranyltransferase type-I
Type:Enzyme
Mol. Mass.:44030.14
Organism:Rattus norvegicus (rat)
Description:Recombinant rat enzyme.
Residue:377
BDBM50284631
NameBDBM50284631
Synonyms:2-(2-{3-[(2-Amino-3-mercapto-propionyl)-methyl-amino]-2-oxo-5-phenyl-2,3-dihydro-benzo[e][1,4]diazepin-1-yl}-acetylamino)-4-methylsulfanyl-butyric acid | CHEMBL418572
TypeSmall organic molecule
Emp. Form.C26H31N5O5S2
Mol. Mass.557.685
SMILESCSCC[C@H](NC(=O)CN1c2ccccc2C(=N[C@@H](N(C)C(=O)[C@@H](N)CS)C1=O)c1ccccc1)C(O)=O