Reaction Details
TargetCysteinyl leukotriene receptor 1
LigandBDBM50284686
Substrate/Competitorn/a
Meas. Tech.ChEBML_99989
Ki 240±n/a nM
Citation Masamune, HEggler, JFMarfat, AMelvin, LSRusek, FWTickner, JECheng, JBShirley, JT LTD4 Receptor binding activity of novel pyridine chromanols: qualitative correlation with pKa Bioorg Med Chem Lett5:1371-1376 (1995)    Article
 
Cysteinyl leukotriene receptor 1
Name:Cysteinyl leukotriene receptor 1
Type:Enzyme Catalytic Domain
Mol. Mass.:39007.58
Organism:GUINEA PIG
Description:Leukotriene D4 0 GUINEA PIG::Q2NNR5
Residue:340
BDBM50284686
NameBDBM50284686
Synonyms:(3S,4S)-6-(6-Methyl-5-nitro-pyridin-2-ylmethoxy)-3-pyridin-3-ylmethyl-chroman-4-ol | CHEMBL283886
TypeSmall organic molecule
Emp. Form.C22H21N3O5
Mol. Mass.407.4192
SMILESCc1nc(COc2ccc3OC[C@H](Cc4cccnc4)[C@H](O)c3c2)ccc1[N+]([O-])=O