Reaction Details
TargetGlutamate receptor ionotropic, NMDA 1
LigandBDBM50284816
Substrate/Competitorn/a
Meas. Tech.ChEBML_140321
Ki 134±n/a nM
Citation Nagata, RKodo, TYamaguchi, HTanno, N Structure-activity relationships of tricyclic quinoxalinediones as potent antagonists for the glycine binding site of the NMDA receptor 2 Bioorg Med Chem Lett5:1533-1536 (1995)    Article
 
Glutamate receptor ionotropic, NMDA 1
Name:Glutamate receptor ionotropic, NMDA 1
Type:Enzyme Catalytic Domain
Mol. Mass.:105533.40
Organism:RAT
Description:P35439
Residue:938
BDBM50284816
NameBDBM50284816
Synonyms:2-(9-Iodo-2,3-dioxo-2,3,6,7-tetrahydro-1H,5H-pyrido[1,2,3-de]quinoxalin-5-yl)-N-phenyl-acetamide | CHEMBL39627
TypeSmall organic molecule
Emp. Form.C19H16IN3O3
Mol. Mass.461.2531
SMILESIc1cc2CCC(CC(=O)Nc3ccccc3)n3c2c(c1)[nH]c(=O)c3=O