Reaction Details
TargetDihydroorotate dehydrogenase (quinone), mitochondrial
LigandBDBM50284837
Substrate/Competitorn/a
Meas. Tech.ChEBML_54063
Ki 40±n/a nM
Citation Batt, DGCopeland, RADowling, RLGardner, TLJones, EAOrwat, MJPinto, DJPitts, WJMagolda, RLJaffee, BD Immunosuppressive structure-activity relationships of Brequinar and related cinchoninic acid derivatives Bioorg Med Chem Lett5:1549-1554 (1995)    Article
 
Dihydroorotate dehydrogenase (quinone), mitochondrial
Name:Dihydroorotate dehydrogenase (quinone), mitochondrial
Type:Enzyme
Mol. Mass.:42881.33
Organism:Homo sapiens (Human)
Description:Q02127
Residue:395
BDBM50284837
NameBDBM50284837
Synonyms:2-(4-tert-Butyl-phenyl)-6-fluoro-3-methyl-quinoline-4-carboxylic acid | CHEMBL416057
TypeSmall organic molecule
Emp. Form.C21H20FNO2
Mol. Mass.337.3874
SMILESCc1c(nc2ccc(F)cc2c1C(O)=O)-c1ccc(cc1)C(C)(C)C