Reaction Details
TargetLeukotriene B4 receptor 1
LigandBDBM50036743
Substrate/Competitorn/a
Meas. Tech.ChEMBL_98502 (CHEMBL709164)
Ki 5.5±n/a nM
Citation Sofia, MJNelson, KHerron, DKGoodson, TFroelich, LLSpaethe, SMMarder, PRoman, CRFleisch, JH 2-alkyl-4-ethyl-5-[6-methyl-6-(2H-tetrazol-5-yl)heptyloxy]phenol leukotriene B4 receptor antagonists Bioorg Med Chem Lett5:1995-2000 (1995)    Article
 
Leukotriene B4 receptor 1
Name:Leukotriene B4 receptor 1
Type:Enzyme Catalytic Domain
Mol. Mass.:37582.68
Organism:Homo sapiens (Human)
Description:Q15722
Residue:352
BDBM50036743
NameBDBM50036743
Synonyms:CHEMBL60617 sodium 4-ethyl-5-[6-methyl-6-(2H-1,2,3,4-tetraazol-5-yl)heptyloxy]-2-propylphenol
TypeSmall organic molecule
Emp. Form.C20H31N4O2
Mol. Mass.359.4863
SMILESCCCc1cc(CC)c(OCCCCCC(C)(C)c2nn[n-]n2)cc1O