Reaction Details
TargetProtein kinase C beta type
LigandBDBM3220
Substrate/Competitorn/a
Meas. Tech.ChEMBL_160623 (CHEMBL768107)
IC50 290±n/a nM
Citation Jr., GEDefauw, JMLai, YSCrane, HMHall, SEBuben, JAHu, HGosnell, PA Novel PKC inhibitory analogs of balanol with replacement of the ester functionality Bioorg Med Chem Lett5:2015-2020 (1995)    Article
 
Protein kinase C beta type
Name:Protein kinase C beta type
Type:Enzyme
Mol. Mass.:76873.67
Organism:Homo sapiens (Human)
Description:The recombinant human PKC enzymes were produced using a baculovirus expression system in SF9 cells
Residue:671
BDBM3220
NameBDBM3220
Synonyms:2-{[2,6-dihydroxy-4-({[(1R,2R)-2-[(4-hydroxybenzene)amido]cyclopentyl]oxy}methyl)phenyl]carbonyl}-3-hydroxybenzoic acid trans-1-[4-(2-Hydroxycarbonyl-6-hydroxybenzoyl)-3,5-dihydroxybenzyloxy]-2-(4-hydroxybenzamido)cyclopentane
TypeSmall organic molecule
Emp. Form.C27H25NO9
Mol. Mass.507.4887
SMILESOC(=O)c1cccc(O)c1C(=O)c1c(O)cc(CO[C@@H]2CCC[C@H]2NC(=O)c2ccc(O)cc2)cc1O