Reaction Details
TargetChymotrypsin-like elastase family member 2A
LigandBDBM50285106
Substrate/Competitorn/a
Meas. Tech.ChEMBL_154797 (CHEMBL761676)
IC50 540±n/a nM
Citation Boschetti, CEMata, EGMascaretti, OACricco, JACoux, GRoveri, OA Synthesis and porcine pancreatic elastase inhibitory evaluation of 6α-(sulfonyl)oxy-and 6α-chloropenicillanate sulfone esters and 3α-(acyloxy)methyl-6α-chloropenam sulfones Bioorg Med Chem Lett5:2033-2036 (1995)    Article
 
Chymotrypsin-like elastase family member 2A
Name:Chymotrypsin-like elastase family member 2A
Type:PROTEIN
Mol. Mass.:28705.23
Organism:Sus scrofa
Description:ChEMBL_156951
Residue:269
BDBM50285106
NameBDBM50285106
Synonyms:(2S,5R,6S)-6-Methanesulfonyloxy-3,3-dimethyl-4,4,7-trioxo-4lambda*6*-thia-1-aza-bicyclo[3.2.0]heptane-2-carboxylic acid 2,2-dimethyl-propionyloxymethyl ester | CHEMBL303961
TypeSmall organic molecule
Emp. Form.C15H23NO10S2
Mol. Mass.441.474
SMILESCC(C)(C)C(=O)OCOC(=O)[C@@H]1N2[C@@H]([C@@H](OS(C)(=O)=O)C2=O)S(=O)(=O)C1(C)C