Reaction Details
TargetNeutrophil elastase
LigandBDBM50285285
Substrate/Competitorn/a
Meas. Tech.ChEMBL_86286 (CHEMBL698901)
Ki 0.34±n/a nM
Citation Desai, RCDunlap, RPFarrell, RPFerguson, EFranke, CAGordon, RHlasta, DJTalomie, TG Alkoxy substituted benzisothiazolone (BIT) derivatives: potent inhibitors of human leukocyte elastase Bioorg Med Chem Lett5:105-109 (1995)    Article
 
Neutrophil elastase
Name:Neutrophil elastase
Type:Enzyme
Mol. Mass.:28532.38
Organism:Homo sapiens (Human)
Description:P08246
Residue:267
BDBM50285285
NameBDBM50285285
Synonyms:2,6-Dichloro-benzoic acid 6-methoxy-1,1,3-trioxo-4-propoxy-1,3-dihydro-1lambda*6*-benzo[d]isothiazol-2-ylmethyl ester | CHEMBL274582
TypeSmall organic molecule
Emp. Form.C19H17Cl2NO7S
Mol. Mass.474.312
SMILESCCCOc1cc(OC)cc2c1C(=O)N(COC(=O)c1c(Cl)cccc1Cl)S2(=O)=O