Reaction Details
TargetNeutrophil elastase
LigandBDBM50285286
Substrate/Competitorn/a
Meas. Tech.ChEMBL_86286 (CHEMBL698901)
Ki 0.070±n/a nM
Citation Desai, RCDunlap, RPFarrell, RPFerguson, EFranke, CAGordon, RHlasta, DJTalomie, TG Alkoxy substituted benzisothiazolone (BIT) derivatives: potent inhibitors of human leukocyte elastase Bioorg Med Chem Lett5:105-109 (1995)    Article
 
Neutrophil elastase
Name:Neutrophil elastase
Type:Enzyme
Mol. Mass.:28532.38
Organism:Homo sapiens (Human)
Description:P08246
Residue:267
BDBM50285286
NameBDBM50285286
Synonyms:2,6-Dichloro-3-(2-morpholin-4-yl-ethoxy)-benzoic acid 4,6-diethoxy-1,1,3-trioxo-1,3-dihydro-1lambda*6*-benzo[d]isothiazol-2-ylmethyl ester | CHEMBL430157
TypeSmall organic molecule
Emp. Form.C25H28Cl2N2O9S
Mol. Mass.603.469
SMILESCCOc1cc2c(C(=O)N(COC(=O)c3c(Cl)ccc(OCCN4CCOCC4)c3Cl)S2(=O)=O)c(OCC)c1