Reaction Details
TargetNeutrophil elastase
LigandBDBM50285288
Substrate/Competitorn/a
Meas. Tech.ChEMBL_86286 (CHEMBL698901)
Ki 0.47±n/a nM
Citation Desai, RCDunlap, RPFarrell, RPFerguson, EFranke, CAGordon, RHlasta, DJTalomie, TG Alkoxy substituted benzisothiazolone (BIT) derivatives: potent inhibitors of human leukocyte elastase Bioorg Med Chem Lett5:105-109 (1995)    Article
 
Neutrophil elastase
Name:Neutrophil elastase
Type:Enzyme
Mol. Mass.:28532.38
Organism:Homo sapiens (Human)
Description:P08246
Residue:267
BDBM50285288
NameBDBM50285288
Synonyms:2,6-Dichloro-benzoic acid 6-methoxy-1,1,3-trioxo-1,3-dihydro-1lambda*6*-benzo[d]isothiazol-2-ylmethyl ester | CHEMBL274347
TypeSmall organic molecule
Emp. Form.C16H11Cl2NO6S
Mol. Mass.416.233
SMILESCOc1ccc2C(=O)N(COC(=O)c3c(Cl)cccc3Cl)S(=O)(=O)c2c1