Reaction Details
TargetNeprilysin
LigandBDBM50034851
Substrate/Competitorn/a
Meas. Tech.ChEBML_144602
IC50 1900±n/a nM
Citation Lombaert, SDBlanchard, LTan, JSakane, YBerry, CGhai, RD Non-peptidic inhibitors of neutral endopeptidase 24.11 1. Discovery and optimization of potency Bioorg Med Chem Lett5:145-150 (1995)    Article
 
Neprilysin
Name:Neprilysin
Type:Protein
Mol. Mass.:85789.59
Organism:Rattus norvegicus (Rat)
Description:P07861
Residue:750
BDBM50034851
NameBDBM50034851
Synonyms:3-[(S)-3-Biphenyl-4-yl-2-(phosphonomethyl-amino)-propionylamino]-propionic acid CHEMBL285038 | diphenyl alpha -aminomethyl phosphonate
TypeSmall organic molecule
Emp. Form.C19H23N2O6P
Mol. Mass.406.3695
SMILESOC(=O)CCNC(=O)[C@H](Cc1ccc(cc1)-c1ccccc1)NCP(O)(O)=O