Reaction Details
TargetNeprilysin
LigandBDBM50285328
Substrate/Competitorn/a
Meas. Tech.ChEBML_144602
IC50 1.4±n/a nM
Citation Lombaert, SDBlanchard, LTan, JSakane, YBerry, CGhai, RD Non-peptidic inhibitors of neutral endopeptidase 24.11 1. Discovery and optimization of potency Bioorg Med Chem Lett5:145-150 (1995)    Article
 
Neprilysin
Name:Neprilysin
Type:Protein
Mol. Mass.:85789.59
Organism:Rattus norvegicus (Rat)
Description:P07861
Residue:750
BDBM50285328
NameBDBM50285328
Synonyms:CHEMBL285747 | {[(S)-2-Biphenyl-4-yl-1-(1H-tetrazol-5-ylcarbamoyl)-ethylamino]-methyl}-phosphonic acid
TypeSmall organic molecule
Emp. Form.C17H19N6O4P
Mol. Mass.402.3443
SMILESOP(O)(=O)CN[C@@H](Cc1ccc(cc1)-c1ccccc1)C(=O)Nc1nnn[nH]1