Reaction Details
Target1,3-beta-glucan synthase
LigandBDBM50285478
Substrate/Competitorn/a
Meas. Tech.ChEBML_37687
IC50 38±n/a nM
Citation Zambias, RAJames, CHammond, MLAbruzzo, GKBartizal, KFNollstadt, KHDouglas, CMarrinan, JBalkovec, JM Antifungal lipopeptides: Structure-activity relationships of 3-hydroxyglutamine-modified pneumocandin B0 derivatives Bioorg Med Chem Lett5:2357-2362 (1995)    Article
 
1,3-beta-glucan synthase
Name:1,3-beta-glucan synthase
Type:Enzyme
Mol. Mass.:218006.59
Organism:Candida albicans (Yeast)
Description:O13428
Residue:1897
BDBM50285478
NameBDBM50285478
Synonyms:1N-{20-[2-(6-aminohexylcarbamoyl)-1-hydroxyethyl]-2,11,15-trihydroxy-6-(1-hydroxyethyl)-23-[1-hydroxy-2-(4-hydroxyphenyl)ethyl]-5,8,14,19,22,25-hexaoxoperhydrodipyrrolo[2,1-c:2,1-l][1,4,7,10,13,16]hexaazacyclohenicosin-9-yl}-10,12-dimethyltetrade | CHEMBL408249
TypeSmall organic molecule
Emp. Form.C56H93N9O15
Mol. Mass.1132.3889
SMILESCCC(C)CC(C)CCCCCCCCC(=O)N[C@H]1C[C@@H](O)CNC(=O)[C@@H]2[C@@H](O)CCN2C(=O)[C@@H](NC(=O)[C@@H](NC(=O)[C@@H]2C[C@@H](O)CN2C(=O)[C@@H](NC1=O)[C@@H](C)O)[C@H](O)Cc1ccc(O)cc1)[C@H](O)CC(=O)NCCCCCCN