Reaction Details
TargetD(2) dopamine receptor
LigandBDBM50285668
Substrate/Competitorn/a
Meas. Tech.ChEMBL_58460 (CHEMBL670391)
Ki 8.80±n/a nM
Citation Wright, JHeffner, TPugsley, TMacKenzie, RWise, L Discovery of selective dopamine D3 ligands: II. 2-[4-[3-(4-aryl-1-piperazinyl)propoxy]phenyl]benzimidazole partial agonists Bioorg Med Chem Lett5:2547-2550 (1995)    Article
 
D(2) dopamine receptor
Name:D(2) dopamine receptor
Type:Cell-surface receptors
Mol. Mass.:50647.10
Organism:Homo sapiens (Human)
Description:P14416
Residue:443
BDBM50285668
NameBDBM50285668
Synonyms:2-(4-{3-[4-(2-Methoxy-phenyl)-piperazin-1-yl]-propoxy}-phenyl)-1H-benzoimidazole | CHEMBL313620
TypeSmall organic molecule
Emp. Form.C27H30N4O2
Mol. Mass.442.5527
SMILESCOc1ccccc1N1CCN(CCCOc2ccc(cc2)-c2nc3ccccc3[nH]2)CC1