Reaction Details
TargetRetinoic acid receptor RXR-gamma
LigandBDBM50032221
Substrate/Competitorn/a
Meas. Tech.ChEBML_197215
EC50 1500±n/a nM
Citation Beard, RLColon, DFKlein, ESVorse, KAChandraratna, RA Differential RXR & RAR activity of stilbene retinoid analogs bearing thiazole and imidazole carboxylic acids Bioorg Med Chem Lett5:2729-2734 (1995)    Article
 
Retinoic acid receptor RXR-gamma
Name:Retinoic acid receptor RXR-gamma
Type:PROTEIN
Mol. Mass.:50878.26
Organism:Homo sapiens (Human)
Description:ChEMBL_197216
Residue:463
BDBM50032221
NameBDBM50032221
Synonyms:4-[(E)-2-(3,5,5,8,8-Pentamethyl-5,6,7,8-tetrahydro-naphthalen-2-yl)-propenyl]-benzoic acid | CHEMBL32505
TypeSmall organic molecule
Emp. Form.C25H30O2
Mol. Mass.362.5045
SMILESC\C(=C/c1ccc(cc1)C(O)=O)c1cc2c(cc1C)C(C)(C)CCC2(C)C