Reaction Details
TargetRetinoic acid receptor beta
LigandBDBM50285920
Substrate/Competitorn/a
Meas. Tech.ChEBML_195473
EC50 46±n/a nM
Citation Beard, RLColon, DFKlein, ESVorse, KAChandraratna, RA Differential RXR & RAR activity of stilbene retinoid analogs bearing thiazole and imidazole carboxylic acids Bioorg Med Chem Lett5:2729-2734 (1995)    Article
 
Retinoic acid receptor beta
Name:Retinoic acid receptor beta
Type:PROTEIN
Mol. Mass.:50498.70
Organism:Homo sapiens (Human)
Description:ChEMBL_1458015
Residue:455
BDBM50285920
NameBDBM50285920
Synonyms:2-[(E)-2-(5,5,8,8-Tetramethyl-5,6,7,8-tetrahydro-naphthalen-2-yl)-propenyl]-thiazole-5-carboxylic acid | CHEMBL93577
TypeSmall organic molecule
Emp. Form.C21H25NO2S
Mol. Mass.355.494
SMILESC\C(=C/c1ncc(s1)C(O)=O)c1ccc2c(c1)C(C)(C)CCC2(C)C