Reaction Details
TargetRetinoic acid receptor gamma
LigandBDBM50032225
Substrate/Competitorn/a
Meas. Tech.ChEBML_195985
EC50 979±n/a nM
Citation Beard, RLColon, DFKlein, ESVorse, KAChandraratna, RA Differential RXR & RAR activity of stilbene retinoid analogs bearing thiazole and imidazole carboxylic acids Bioorg Med Chem Lett5:2729-2734 (1995)    Article
 
Retinoic acid receptor gamma
Name:Retinoic acid receptor gamma
Type:PROTEIN
Mol. Mass.:50345.43
Organism:Homo sapiens (Human)
Description:ChEMBL_1458016
Residue:454
BDBM50032225
NameBDBM50032225
Synonyms:5-[(E)-2-(3,5,5,8,8-Pentamethyl-5,6,7,8-tetrahydro-naphthalen-2-yl)-propenyl]-thiophene-3-carboxylic acid | CHEMBL93628
TypeSmall organic molecule
Emp. Form.C23H28O2S
Mol. Mass.368.532
SMILESC\C(=C/c1cc(cs1)C(O)=O)c1cc2c(cc1C)C(C)(C)CCC2(C)C