Reaction Details
TargetRetinoic acid receptor RXR-beta
LigandBDBM50285918
Substrate/Competitorn/a
Meas. Tech.ChEBML_197054
EC50 2300±n/a nM
Citation Beard, RLColon, DFKlein, ESVorse, KAChandraratna, RA Differential RXR & RAR activity of stilbene retinoid analogs bearing thiazole and imidazole carboxylic acids Bioorg Med Chem Lett5:2729-2734 (1995)    Article
 
Retinoic acid receptor RXR-beta
Name:Retinoic acid receptor RXR-beta
Type:PROTEIN
Mol. Mass.:56932.89
Organism:Homo sapiens (Human)
Description:ChEMBL_39045
Residue:533
BDBM50285918
NameBDBM50285918
Synonyms:5-[(E)-2-(5,5,8,8-Tetramethyl-5,6,7,8-tetrahydro-naphthalen-2-yl)-propenyl]-thiophene-2-carboxylic acid | CHEMBL93538
TypeSmall organic molecule
Emp. Form.C22H26O2S
Mol. Mass.354.506
SMILESC\C(=C/c1ccc(s1)C(O)=O)c1ccc2c(c1)C(C)(C)CCC2(C)C