Reaction Details
TargetPlatelet-activating factor receptor
LigandBDBM50286033
Substrate/Competitorn/a
Meas. Tech.ChEBML_155151
Ki 6±n/a nM
Citation Sheppard, GSDavidsen, SKCarrera, GMPireh, DHolms, JHHeyman, HRSteinman, DHCurtin, MLConway, RGRhein, DAAlbert, DHTapang, PMagoc, TJSummers, JB Synthesis and evaluation of water soluble indole pyrrolothiazole paf antagonists Bioorg Med Chem Lett5:2913-2918 (1995)    Article
 
Platelet-activating factor receptor
Name:Platelet-activating factor receptor
Type:Protein
Mol. Mass.:39005.63
Organism:Cavia porcellus
Description:n/a
Residue:342
BDBM50286033
NameBDBM50286033
Synonyms:CHEMBL99481 | indole analogue
TypeSmall organic molecule
Emp. Form.C32H29FN6O3S
Mol. Mass.596.674
SMILESCN(C)C(=O)O\N=C(/c1ccn2[C@H](SCc12)c1cccnc1)c1cn(C(=O)N(C)C)c2cc(ccc12)-c1ccc(F)cc1