Reaction Details
TargetPlatelet-activating factor receptor
LigandBDBM50286023
Substrate/Competitorn/a
Meas. Tech.ChEBML_155151
Ki 74±n/a nM
Citation Sheppard, GSDavidsen, SKCarrera, GMPireh, DHolms, JHHeyman, HRSteinman, DHCurtin, MLConway, RGRhein, DAAlbert, DHTapang, PMagoc, TJSummers, JB Synthesis and evaluation of water soluble indole pyrrolothiazole paf antagonists Bioorg Med Chem Lett5:2913-2918 (1995)    Article
 
Platelet-activating factor receptor
Name:Platelet-activating factor receptor
Type:Protein
Mol. Mass.:39005.63
Organism:Cavia porcellus
Description:n/a
Residue:342
BDBM50286023
NameBDBM50286023
Synonyms:CHEMBL99773 | [1-[1-Dimethylcarbamoyl-6-(4-fluoro-phenyl)-1H-indol-3-yl]-1-((R)-3-pyridin-3-yl-1H-pyrrolo[1,2-c]thiazol-7-yl)-meth-(Z)-ylideneaminooxy]-acetic acid
TypeSmall organic molecule
Emp. Form.C31H26FN5O4S
Mol. Mass.583.633
SMILESCN(C)C(=O)n1cc(\C(=N\OCC(O)=O)c2ccn3[C@H](SCc23)c2cccnc2)c2ccc(cc12)-c1ccc(F)cc1