Reaction Details
TargetPlatelet-activating factor receptor
LigandBDBM50286041
Substrate/Competitorn/a
Meas. Tech.ChEBML_155151
Ki 4000±n/a nM
Citation Sheppard, GSDavidsen, SKCarrera, GMPireh, DHolms, JHHeyman, HRSteinman, DHCurtin, MLConway, RGRhein, DAAlbert, DHTapang, PMagoc, TJSummers, JB Synthesis and evaluation of water soluble indole pyrrolothiazole paf antagonists Bioorg Med Chem Lett5:2913-2918 (1995)    Article
 
Platelet-activating factor receptor
Name:Platelet-activating factor receptor
Type:Protein
Mol. Mass.:39005.63
Organism:Cavia porcellus
Description:n/a
Residue:342
BDBM50286041
NameBDBM50286041
Synonyms:5-{(R)-7-[1-Dimethylcarbamoyl-6-(4-fluoro-phenyl)-1H-indole-3-carbonyl]-1H-pyrrolo[1,2-c]thiazol-3-yl}-1-methyl-1,2-dihydro-pyridinium; iodide | CHEMBL99395
TypeSmall organic molecule
Emp. Form.C30H28FN4O2S
Mol. Mass.527.632
SMILESCN(C)C(=O)n1cc(C(=O)c2ccn3[C@H](SCc23)C2=C[NH+](C)CC=C2)c2ccc(cc12)-c1ccc(F)cc1