Reaction Details
TargetPlatelet-activating factor receptor
LigandBDBM50286030
Substrate/Competitorn/a
Meas. Tech.ChEBML_155151
Ki 19±n/a nM
Citation Sheppard, GSDavidsen, SKCarrera, GMPireh, DHolms, JHHeyman, HRSteinman, DHCurtin, MLConway, RGRhein, DAAlbert, DHTapang, PMagoc, TJSummers, JB Synthesis and evaluation of water soluble indole pyrrolothiazole paf antagonists Bioorg Med Chem Lett5:2913-2918 (1995)    Article
 
Platelet-activating factor receptor
Name:Platelet-activating factor receptor
Type:Protein
Mol. Mass.:39005.63
Organism:Cavia porcellus
Description:n/a
Residue:342
BDBM50286030
NameBDBM50286030
Synonyms:CHEMBL319609 | [6-(4-Fluoro-phenyl)-1-tetrazol-2-ylmethyl-1H-indol-3-yl]-((R)-3-pyridin-3-yl-1H-pyrrolo[1,2-c]thiazol-7-yl)-methanone
TypeSmall organic molecule
Emp. Form.C28H20FN7OS
Mol. Mass.521.568
SMILESFc1ccc(cc1)-c1ccc2c(cn(Cn3ncnn3)c2c1)C(=O)c1ccn2[C@H](SCc12)c1cccnc1