Reaction Details
TargetPlatelet-activating factor receptor
LigandBDBM50286036
Substrate/Competitorn/a
Meas. Tech.ChEBML_155151
Ki 200±n/a nM
Citation Sheppard, GSDavidsen, SKCarrera, GMPireh, DHolms, JHHeyman, HRSteinman, DHCurtin, MLConway, RGRhein, DAAlbert, DHTapang, PMagoc, TJSummers, JB Synthesis and evaluation of water soluble indole pyrrolothiazole paf antagonists Bioorg Med Chem Lett5:2913-2918 (1995)    Article
 
Platelet-activating factor receptor
Name:Platelet-activating factor receptor
Type:Protein
Mol. Mass.:39005.63
Organism:Cavia porcellus
Description:n/a
Residue:342
BDBM50286036
NameBDBM50286036
Synonyms:3-[[(Z)-2-Dimethylamino-ethoxyimino]-((R)-3-pyridin-3-yl-1H-pyrrolo[1,2-c]thiazol-7-yl)-methyl]-6-(4-fluoro-phenyl)-indole-1-carboxylic acid dimethylamide | CHEMBL329498
TypeSmall organic molecule
Emp. Form.C33H33FN6O2S
Mol. Mass.596.718
SMILESCN(C)CCO\N=C(/c1ccn2[C@H](SCc12)c1cccnc1)c1cn(C(=O)N(C)C)c2cc(ccc12)-c1ccc(F)cc1