Reaction Details
TargetPlatelet-activating factor receptor
LigandBDBM50286031
Substrate/Competitorn/a
Meas. Tech.ChEBML_155151
Ki 53±n/a nM
Citation Sheppard, GSDavidsen, SKCarrera, GMPireh, DHolms, JHHeyman, HRSteinman, DHCurtin, MLConway, RGRhein, DAAlbert, DHTapang, PMagoc, TJSummers, JB Synthesis and evaluation of water soluble indole pyrrolothiazole paf antagonists Bioorg Med Chem Lett5:2913-2918 (1995)    Article
 
Platelet-activating factor receptor
Name:Platelet-activating factor receptor
Type:Protein
Mol. Mass.:39005.63
Organism:Cavia porcellus
Description:n/a
Residue:342
BDBM50286031
NameBDBM50286031
Synonyms:CHEMBL318009 | indole analogue
TypeSmall organic molecule
Emp. Form.C36H27FN5O6S2
Mol. Mass.708.758
SMILESCN(C)C(=O)n1cc(\C(=N\OC(=O)c2ccc(cc2)S([O-])(=O)=O)c2ccn3[C@H](SCc23)c2cccnc2)c2ccc(cc12)-c1ccc(F)cc1